Target
Somatostatin receptor type 1
Ligand
BDBM50370051
Substrate
Meas. Tech.
ChEMBL_200541 (CHEMBL805045)
Ki
1000±n/a nM
Citation
 Rajeswaran, WGHocart, SJMurphy, WATaylor, JECoy, DH Highly potent and subtype selective ligands derived by N-methyl scan of a somatostatin antagonist. J Med Chem 44:1305-11 (2001)  
Target
Name:
Somatostatin receptor type 1
Synonyms:
SOMATOSTATIN SST1 SS-1-R SS1R SSTR1 | Somatostatin receptor type 1 (SSTR1)
Type:
Enzyme
Mol. Mass.:
42692.81
Organism:
Homo sapiens (Human)
Description:
P30872
Residue:
391
  
Inhibitor
Name:
BDBM50370051
Synonyms:
CHEMBL1794043
Type:
Small organic molecule
Emp. Form.:
C60H71N13O9S2
Mol. Mass.:
1182.417
SMILES:
C[C@H](O)[C@H]1NC(=O)[C@H](CCCCN)N(C)C(=O)[C@@H](Cc2c[nH]c3ccccc23)NC(=O)C(Cc2cccnc2)NC(=O)[C@H](CSSC[C@@H](NC1=O)C(=O)NC(Cc1c[nH]c2ccccc12)C(N)=O)NC(=O)C(N)Cc1ccc2ccccc2c1
: