Target
Beta-2 adrenergic receptor
Ligand
BDBM50070156
Substrate
Meas. Tech.
ChEMBL_218117 (CHEMBL821784)
EC50
20±n/a nM
Citation
 Hu, BEllingboe, JHan, SLargis, EMulvey, ROliphant, ASum, FWTillett, J (4-Piperidin-1-yl)phenyl amides: potent and selective human beta(3) agonists. J Med Chem 44:1456-66 (2001)  
Target
Name:
Beta-2 adrenergic receptor
Synonyms:
ADRB2 ADRB2_HUMAN Beta-2 adrenoceptor | Beta-2 adrenoreceptor
Type:
Mol. Mass.:
46461.69
Organism:
Homo sapiens (Human)
Description:
P07550
Residue:
413
  
Inhibitor
Name:
BDBM50070156
Synonyms:
(S)-4-(3-hexylureido)-N-(4-(2-(1-hydroxy-2-(4-hydroxyphenoxy)ethylamino)ethyl)phenyl)benzenesulfonamide 4-(3-Hexyl-ureido)-N-(4-{2-[(S)-2-hydroxy-3-(4-hydroxy-phenoxy)-propylamino]-ethyl}-phenyl)-benzenesulfonamide CHEMBL12998 | L-755507
Type:
Small organic molecule
Emp. Form.:
C30H40N4O6S
Mol. Mass.:
584.727
SMILES:
CCCCCCNC(=O)Nc1ccc(cc1)S(=O)(=O)Nc1ccc(CCNC[C@H](O)COc2ccc(O)cc2)cc1
: