Target
Beta-1 adrenergic receptor
Ligand
BDBM50098670
Substrate
Meas. Tech.
ChEMBL_218111 (CHEMBL822473)
EC50
1600±n/a nM
Citation
 Hu, BEllingboe, JHan, SLargis, EMulvey, ROliphant, ASum, FWTillett, J (4-Piperidin-1-yl)phenyl amides: potent and selective human beta(3) agonists. J Med Chem 44:1456-66 (2001)  
Target
Name:
Beta-1 adrenergic receptor
Synonyms:
ADRB1 ADRB1_HUMAN Beta-1 adrenoceptor | adrenergic Beta1
Type:
G Protein-Coupled Receptor (GPCR)
Mol. Mass.:
51338.40
Organism:
Homo sapiens (Human)
Description:
P08588
Residue:
477
  
Inhibitor
Name:
BDBM50098670
Synonyms:
(4-{4-[2-Hydroxy-2-(4-hydroxy-3-methanesulfonylamino-phenyl)-ethylamino]-piperidin-1-yl}-benzyloxy)-acetic acid | CHEMBL32888
Type:
Small organic molecule
Emp. Form.:
C23H31N3O7S
Mol. Mass.:
493.573
SMILES:
CS(=O)(=O)Nc1cc(ccc1O)[C@@H](O)CNC1CCN(CC1)c1ccc(COCC(O)=O)cc1
: