Target
P2Y purinoceptor 1
Ligand
BDBM50409525
Substrate
Meas. Tech.
ChEMBL_162517 (CHEMBL766763)
EC50
3900±n/a nM
Citation
 Ravi, RGKim, HSServos, JZimmermann, HLee, KMaddileti, SBoyer, JLHarden, TKJacobson, KA Adenine nucleotide analogues locked in a Northern methanocarba conformation: enhanced stability and potency as P2Y(1) receptor agonists. J Med Chem 45:2090-100 (2002)  
Target
Name:
P2Y purinoceptor 1
Synonyms:
P2RY1 | P2RY1_MELGA
Type:
Mol. Mass.:
41199.64
Organism:
Meleagris gallopavo
Description:
Residue:
362
  
Inhibitor
Name:
BDBM50409525
Synonyms:
CHEMBL2112090
Type:
Small organic molecule
Emp. Form.:
C12H15ClN5O6P
Mol. Mass.:
391.704
SMILES:
Nc1nc(Cl)nc2n(cnc12)[C@@H]1[C@H]2C[C@@]2(COP(O)(O)=O)[C@@H](O)[C@H]1O
: