Target
Androgen receptor
Ligand
BDBM50113776
Substrate
Meas. Tech.
ChEMBL_36270 (CHEMBL648837)
Ki
690±n/a nM
Citation
 Morgan, BPSwick, AGHargrove, DMLaFlamme, JAMoynihan, MSCarroll, RSMartin, KALee, EDecosta, DBordner, J Discovery of potent, nonsteroidal, and highly selective glucocorticoid receptor antagonists. J Med Chem 45:2417-24 (2002)  
Target
Name:
Androgen receptor
Synonyms:
ANDR_HUMAN Androgen Receptor Androgen receptor/Baculoviral IAP repeat-containing protein 2 Dihydrotestosterone receptor Nuclear receptor subfamily 3 group C member 4
Type:
Receptor
Mol. Mass.:
99185.27
Organism:
Homo sapiens (Human)
Description:
CHO cells were stably transfected with human AR gene.
Residue:
920
  
Inhibitor
Name:
BDBM50113776
Synonyms:
(R)-4a-Benzyl-7-methoxy-4,4a,9,10-tetrahydro-3H-phenanthren-2-one | CHEMBL78807
Type:
Small organic molecule
Emp. Form.:
C22H22O2
Mol. Mass.:
318.4089
SMILES:
COc1ccc2c(CCC3=CC(=O)CC[C@@]23Cc2ccccc2)c1
: