Target
Progesterone receptor
Ligand
BDBM50113779
Substrate
Meas. Tech.
ChEMBL_159546 (CHEMBL765662)
Ki
>10000±n/a nM
Citation
 Morgan, BPSwick, AGHargrove, DMLaFlamme, JAMoynihan, MSCarroll, RSMartin, KALee, EDecosta, DBordner, J Discovery of potent, nonsteroidal, and highly selective glucocorticoid receptor antagonists. J Med Chem 45:2417-24 (2002)  
Target
Name:
Progesterone receptor
Synonyms:
NR3C3 PGR PRGR_HUMAN | progesterone
Type:
Protein
Mol. Mass.:
98979.52
Organism:
Homo sapiens (Human)
Description:
P06401
Residue:
933
  
Inhibitor
Name:
BDBM50113779
Synonyms:
(S)-4a-Benzyl-7-hydroxy-4,4a,9,10-tetrahydro-3H-phenanthren-2-one | CHEMBL310370
Type:
Small organic molecule
Emp. Form.:
C21H20O2
Mol. Mass.:
304.3823
SMILES:
Oc1ccc2c(CCC3=CC(=O)CC[C@]23Cc2ccccc2)c1
: