Target
Androgen receptor
Ligand
BDBM50113783
Substrate
Meas. Tech.
ChEMBL_36270 (CHEMBL648837)
Ki
130±n/a nM
Citation
 Morgan, BPSwick, AGHargrove, DMLaFlamme, JAMoynihan, MSCarroll, RSMartin, KALee, EDecosta, DBordner, J Discovery of potent, nonsteroidal, and highly selective glucocorticoid receptor antagonists. J Med Chem 45:2417-24 (2002)  
Target
Name:
Androgen receptor
Synonyms:
ANDR_HUMAN Androgen Receptor Androgen receptor/Baculoviral IAP repeat-containing protein 2 Dihydrotestosterone receptor Nuclear receptor subfamily 3 group C member 4
Type:
Receptor
Mol. Mass.:
99185.27
Organism:
Homo sapiens (Human)
Description:
CHO cells were stably transfected with human AR gene.
Residue:
920
  
Inhibitor
Name:
BDBM50113783
Synonyms:
(2R,4aS,10aR)-4a-benzyl-2-(chloroethynyl)-1,2,3,4,4a,9,10,10a-octahydrophenanthrene-2,7-diol CHEMBL77779 | CP-394531
Type:
Small organic molecule
Emp. Form.:
C23H23ClO2
Mol. Mass.:
366.881
SMILES:
Oc1ccc2c(CC[C@@H]3C[C@](O)(CC[C@@]23Cc2ccccc2)C#CCl)c1
: