Target
Serine protease 1
Ligand
BDBM50038002
Substrate
Meas. Tech.
ChEMBL_212197 (CHEMBL817760)
Ki
18400±n/a nM
Citation
 Cozzini, PFornabaio, MMarabotti, AAbraham, DJKellogg, GEMozzarelli, A Simple, intuitive calculations of free energy of binding for protein-ligand complexes. 1. Models without explicit constrained water. J Med Chem 45:2469-83 (2002)  
Target
Name:
Serine protease 1
Synonyms:
Alpha-trypsin chain 1 Beta-trypsin PRSS1 TRP1 TRY1_HUMAN Thrombin & trypsin Trypsin I | Trypsin-1
Type:
Enzyme
Mol. Mass.:
26557.80
Organism:
Homo sapiens (Human)
Description:
P07477
Residue:
247
  
Inhibitor
Name:
BDBM50038002
Synonyms:
Benzamidine (Protonated) CHEMBL537204 | benzamidine
Type:
Small organic molecule
Emp. Form.:
C7H8N2
Mol. Mass.:
120.1518
SMILES:
NC(=N)c1ccccc1
: