Target
Melanocyte-stimulating hormone receptor
Ligand
BDBM50114738
Substrate
Meas. Tech.
ChEMBL_106825 (CHEMBL717666)
EC50
6600±n/a nM
Citation
 Holder, JRBauzo, RMXiang, ZHaskell-Luevano, C Structure-activity relationships of the melanocortin tetrapeptide Ac-His-DPhe-Arg-Trp-NH(2) at the mouse melanocortin receptors. 1. Modifications at the His position. J Med Chem 45:2801-10 (2002)  
Target
Name:
Melanocyte-stimulating hormone receptor
Synonyms:
MC1-R Mc1r Melanocyte-stimulating hormone receptor | Msh-r
Type:
PROTEIN
Mol. Mass.:
35238.60
Organism:
Mus musculus
Description:
ChEMBL_1498846
Residue:
315
  
Inhibitor
Name:
BDBM50114738
Synonyms:
1N-[1-carbamoyl-2-(1H-3-indolyl)-(1S)-ethyl]-5-amino(imino)methylamino-2-[1-[2-(1H-3-indolyl)-1-methylcarboxamido-(1R)-ethylcarboxamido]-2-phenyl-(1R)-ethylcarboxamido]-(2S)-pentanamide | CHEMBL432027
Type:
Small organic molecule
Emp. Form.:
C39H46N10O5
Mol. Mass.:
734.8465
SMILES:
CC(=O)N[C@H](Cc1c[nH]c2ccccc12)C(=O)N[C@H](Cc1ccccc1)C(=O)N[C@@H](CCCNC(N)=N)C(=O)N[C@@H](Cc1c[nH]c2ccccc12)C(N)=O
: