Target
Melanocortin receptor 4
Ligand
BDBM50114744
Substrate
Meas. Tech.
ChEMBL_104252 (CHEMBL714370)
EC50
1500±n/a nM
Citation
 Holder, JRBauzo, RMXiang, ZHaskell-Luevano, C Structure-activity relationships of the melanocortin tetrapeptide Ac-His-DPhe-Arg-Trp-NH(2) at the mouse melanocortin receptors. 1. Modifications at the His position. J Med Chem 45:2801-10 (2002)  
Target
Name:
Melanocortin receptor 4
Synonyms:
MC4-R Mc4r
Type:
PROTEIN
Mol. Mass.:
36964.43
Organism:
Mus musculus
Description:
ChEMBL_1498850
Residue:
332
  
Inhibitor
Name:
BDBM50114744
Synonyms:
1N-[1-carbamoyl-2-(1H-3-indolyl)-(1S)-ethyl]-5-amino(imino)methylamino-2-[1-[1-methylcarboxamido-2-(2-naphthyl)-(1R)-ethylcarboxamido]-2-phenyl-(1R)-ethylcarboxamido]-(2S)-pentanamide | CHEMBL329490
Type:
Small organic molecule
Emp. Form.:
C41H47N9O5
Mol. Mass.:
745.8692
SMILES:
CC(=O)N[C@H](Cc1ccc2ccccc2c1)C(=O)N[C@H](Cc1ccccc1)C(=O)N[C@@H](CCCNC(N)=N)C(=O)N[C@@H](Cc1c[nH]c2ccccc12)C(N)=O
: