Target
Melanocortin receptor 4
Ligand
BDBM50114733
Substrate
Meas. Tech.
ChEMBL_104252 (CHEMBL714370)
EC50
2900±n/a nM
Citation
 Holder, JRBauzo, RMXiang, ZHaskell-Luevano, C Structure-activity relationships of the melanocortin tetrapeptide Ac-His-DPhe-Arg-Trp-NH(2) at the mouse melanocortin receptors. 1. Modifications at the His position. J Med Chem 45:2801-10 (2002)  
Target
Name:
Melanocortin receptor 4
Synonyms:
MC4-R Mc4r
Type:
PROTEIN
Mol. Mass.:
36964.43
Organism:
Mus musculus
Description:
ChEMBL_1498850
Residue:
332
  
Inhibitor
Name:
BDBM50114733
Synonyms:
3N-[1-[4-amino(imino)methylamino-1-[1-carbamoyl-2-(1H-3-indolyl)-(1S)-ethylcarbamoyl]-(1S)-butylcarbamoyl]-2-phenyl-(1R)-ethyl]-2-acetyl-(3S)-1,4-dihydro-3-isoquinolinecarboxamide | CHEMBL96871
Type:
Small organic molecule
Emp. Form.:
C38H45N9O5
Mol. Mass.:
707.8212
SMILES:
CC(=O)N1Cc2ccccc2C[C@H]1C(=O)N[C@H](Cc1ccccc1)C(=O)N[C@@H](CCCNC(N)=N)C(=O)N[C@@H](Cc1c[nH]c2ccccc12)C(N)=O
: