Target
Adenosine receptor A3
Ligand
BDBM50370121
Substrate
Meas. Tech.
ChEMBL_31705 (CHEMBL644949)
Ki
4.9±n/a nM
Citation
 Volpini, RCostanzi, SLambertucci, CTaffi, SVittori, SKlotz, KNCristalli, G N(6)-alkyl-2-alkynyl derivatives of adenosine as potent and selective agonists at the human adenosine A(3) receptor and a starting point for searching A(2B) ligands. J Med Chem 45:3271-9 (2002)  
Target
Name:
Adenosine receptor A3
Synonyms:
A3 adenosine receptor (hA3) ADORA3 | Adenosine A3 receptor (A3AR)
Type:
G Protein-Coupled Receptor (GPCR)
Mol. Mass.:
36197.32
Organism:
Homo sapiens (Human)
Description:
P0DMS8
Residue:
318
  
Inhibitor
Name:
BDBM50370121
Synonyms:
CHEMBL607759
Type:
Small organic molecule
Emp. Form.:
C20H21N5O4
Mol. Mass.:
395.4118
SMILES:
CCNc1nc(nc2n(cnc12)C1O[C@H](CO)[C@@H](O)[C@H]1O)C#Cc1ccccc1
: