Target
Adenosine receptor A3
Ligand
BDBM50009263
Substrate
Meas. Tech.
ChEMBL_31705 (CHEMBL644949)
Ki
2.4±n/a nM
Citation
 Volpini, RCostanzi, SLambertucci, CTaffi, SVittori, SKlotz, KNCristalli, G N(6)-alkyl-2-alkynyl derivatives of adenosine as potent and selective agonists at the human adenosine A(3) receptor and a starting point for searching A(2B) ligands. J Med Chem 45:3271-9 (2002)  
Target
Name:
Adenosine receptor A3
Synonyms:
A3 adenosine receptor (hA3) ADORA3 | Adenosine A3 receptor (A3AR)
Type:
G Protein-Coupled Receptor (GPCR)
Mol. Mass.:
36197.32
Organism:
Homo sapiens (Human)
Description:
P0DMS8
Residue:
318
  
Inhibitor
Name:
BDBM50009263
Synonyms:
(2S,3S,4R,5R)-5-(6-amino-2-(hex-1-ynyl)-9H-purin-9-yl)-N-ethyl-3,4-dihydroxy-tetrahydrofuran-2-carboxamide CHEMBL75416 | tert-butyl 1-[3-(1-amino-2-benzyloxycarbamoylethylcarboxamido)-2-hydroxy-4-phenylbutyl]tetrahydro-1H-2-pyrrolecarboxylate
Type:
Small organic molecule
Emp. Form.:
C31H42N4O7
Mol. Mass.:
582.6878
SMILES:
CC(C)(C)OC(=O)C1CCCN1CC(O)[C@H](Cc1ccccc1)NC(=O)[C@H](CC(N)=O)NC(=O)OCc1ccccc1
: