Target
Adenosine receptor A2a
Ligand
BDBM50370134
Substrate
Meas. Tech.
ChEMBL_32152 (CHEMBL646279)
Ki
670±n/a nM
Citation
 Müller, CEThorand, MQurishi, RDiekmann, MJacobson, KAPadgett, WLDaly, JW Imidazo[2,1-i]purin-5-ones and related tricyclic water-soluble purine derivatives: potent A(2A)- and A(3)-adenosine receptor antagonists. J Med Chem 45:3440-50 (2002)  
Target
Name:
Adenosine receptor A2a
Synonyms:
AA2AR_RAT Adenosine A2 receptor Adenosine Receptors A2a (A2a) Adenosine receptors A2a Rat striatal adenosine A2a receptor
Type:
G Protein-Coupled Receptor (GPCR)
Mol. Mass.:
45015.65
Organism:
Rattus norvegicus (rat)
Description:
Rat A2A receptors expressed in CHO cells.
Residue:
410
  
Inhibitor
Name:
BDBM50370134
Synonyms:
CHEMBL1744045
Type:
Small organic molecule
Emp. Form.:
C18H19N5O
Mol. Mass.:
321.3764
SMILES:
CC[C@H]1Cn2c(N1)c1nc(C=Cc3ccccc3)nc1n(C)c2=O
: