Target
Platelet-derived growth factor receptor beta
Ligand
BDBM50117305
Substrate
Meas. Tech.
ChEMBL_158652 (CHEMBL763438)
IC50
175±n/a nM
Citation
 Pandey, AVolkots, DLSeroogy, JMRose, JWYu, JCLambing, JLHutchaleelaha, AHollenbach, SJAbe, KGiese, NAScarborough, RM Identification of orally active, potent, and selective 4-piperazinylquinazolines as antagonists of the platelet-derived growth factor receptor tyrosine kinase family. J Med Chem 45:3772-93 (2002)  
Target
Name:
Platelet-derived growth factor receptor beta
Synonyms:
Beta-type platelet-derived growth factor receptor CD140b antigen PDGF Receptor Substrate PDGFR PDGFR-1 PDGFRB PGFRB_HUMAN Platelet-derived growth factor receptor 1 Platelet-derived growth factor receptor beta (PDGFR-beta) Platelet-derived growth factor receptor beta (PDGFRbeta) | VHL/PDGFRB
Type:
Enzyme
Mol. Mass.:
123922.25
Organism:
Homo sapiens (Human)
Description:
P09619
Residue:
1106
  
Inhibitor
Name:
BDBM50117305
Synonyms:
4-[6-(2-Methoxy-ethoxy)-7-(2-pyrrolidin-1-yl-ethoxy)-quinazolin-4-yl]-piperazine-1-carboxylic acid (4-isopropoxy-phenyl)-amide | CHEMBL338330
Type:
Small organic molecule
Emp. Form.:
C31H42N6O5
Mol. Mass.:
578.7024
SMILES:
COCCOc1cc2c(ncnc2cc1OCCN1CCCC1)N1CCN(CC1)C(=O)Nc1ccc(OC(C)C)cc1
: