Target
P2Y purinoceptor 1
Ligand
BDBM50368125
Substrate
Meas. Tech.
ChEMBL_147717 (CHEMBL759187)
EC50
8000±n/a nM
Citation
 Jacobson, KAJarvis, MFWilliams, M Purine and pyrimidine (P2) receptors as drug targets. J Med Chem 45:4057-93 (2002)  
Target
Name:
P2Y purinoceptor 1
Synonyms:
P2RY1 | P2RY1_MELGA
Type:
Mol. Mass.:
41199.64
Organism:
Meleagris gallopavo
Description:
Residue:
362
  
Inhibitor
Name:
BDBM50368125
Synonyms:
ADENOSINE DIPHOSPHATE | ADP
Type:
Small organic molecule
Emp. Form.:
C10H15N5O10P2
Mol. Mass.:
427.2011
SMILES:
Nc1ncnc2n(cnc12)[C@@H]1O[C@H](CO[P@@](O)(=O)OP(O)(O)=O)[C@@H](O)[C@H]1O
: