Target
P2Y purinoceptor 1
Ligand
BDBM50118226
Substrate
Meas. Tech.
ChEMBL_147717 (CHEMBL759187)
EC50
1.5±n/a nM
Citation
 Jacobson, KAJarvis, MFWilliams, M Purine and pyrimidine (P2) receptors as drug targets. J Med Chem 45:4057-93 (2002)  
Target
Name:
P2Y purinoceptor 1
Synonyms:
P2RY1 | P2RY1_MELGA
Type:
Mol. Mass.:
41199.64
Organism:
Meleagris gallopavo
Description:
Residue:
362
  
Inhibitor
Name:
BDBM50118226
Synonyms:
CHEMBL337062 | PAPET-ATP
Type:
Small organic molecule
Emp. Form.:
C18H25N6O13P3S
Mol. Mass.:
658.41
SMILES:
Nc1ccc(CCSc2nc(N)c3ncn([C@@H]4O[C@H](COP(O)(=O)OP(O)(=O)OP(O)(O)=O)[C@@H](O)[C@H]4O)c3n2)cc1
: