Target
P2X purinoceptor 7
Ligand
BDBM50118219
Substrate
Meas. Tech.
ChEMBL_147420 (CHEMBL754454)
EC50
52000±n/a nM
Citation
 Jacobson, KAJarvis, MFWilliams, M Purine and pyrimidine (P2) receptors as drug targets. J Med Chem 45:4057-93 (2002)  
Target
Name:
P2X purinoceptor 7
Synonyms:
ATP receptor P2RX7_HUMAN P2X purinoceptor 7 (P2X7) P2Z receptor | Purinergic receptor
Type:
Protein
Mol. Mass.:
68602.85
Organism:
Homo sapiens (Human)
Description:
Q99572
Residue:
595
  
Inhibitor
Name:
BDBM50118219
Synonyms:
Bz-ATP | CHEMBL339386
Type:
Small organic molecule
Emp. Form.:
C23H24N5O14P3
Mol. Mass.:
687.383
SMILES:
Nc1ncnc2n(cnc12)[C@@H]1O[C@H](COP(O)(=O)OP(O)(=O)OP(O)(O)=O)[C@@H](O)[C@H]1OC(=O)c1ccc(cc1)-c1ccccc1
: