Target
P2X purinoceptor 3
Ligand
BDBM50064803
Substrate
Meas. Tech.
ChEMBL_147406 (CHEMBL750980)
IC50
58300±n/a nM
Citation
 Jacobson, KAJarvis, MFWilliams, M Purine and pyrimidine (P2) receptors as drug targets. J Med Chem 45:4057-93 (2002)  
Target
Name:
P2X purinoceptor 3
Synonyms:
ATP receptor P2RX3 P2X purinoceptor 3 P2X purinoceptor 3 (P2X3) P2X3 purinoceptor p2x3 + hsa
Type:
Protein
Mol. Mass.:
44292.02
Organism:
Homo sapiens (Human)
Description:
P56373
Residue:
397
  
Inhibitor
Name:
BDBM50064803
Synonyms:
3-Methyl-7-oxo-5,9-dihydro-6,8-dioxa-2-aza-7lambda*5*-phospha-benzocycloheptene-4,7-diol MRS 2220
Type:
Small organic molecule
Emp. Form.:
C8H10NO5P
Mol. Mass.:
231.1425
SMILES:
Cc1ncc2COP(O)(=O)OCc2c1O
: