Target
P2Y purinoceptor 2
Ligand
BDBM50118220
Substrate
Meas. Tech.
ChEMBL_147568 (CHEMBL751765)
EC50
720±n/a nM
Citation
 Jacobson, KAJarvis, MFWilliams, M Purine and pyrimidine (P2) receptors as drug targets. J Med Chem 45:4057-93 (2002)  
Target
Name:
P2Y purinoceptor 2
Synonyms:
ATP receptor P2RY2 P2U purinoceptor 1 P2Y purinoceptor 2 Purinergic receptor | Purinergic receptor P2Y2
Type:
PROTEIN
Mol. Mass.:
42299.21
Organism:
Homo sapiens (Human)
Description:
ChEMBL_1455361
Residue:
377
  
Inhibitor
Name:
BDBM50118220
Synonyms:
(ppA)2 CHEMBL339385 adenosine(5')tetraphospho(5')adenosine | bis(5'-adenylyl) diphosphate
Type:
Small organic molecule
Emp. Form.:
C20H28N10O19P4
Mol. Mass.:
836.387
SMILES:
Nc1ncnc2n(cnc12)[C@@H]1O[C@H](COP(O)(=O)OP(O)(=O)OP(O)(=O)OP(O)(=O)OC[C@H]2O[C@H]([C@H](O)[C@@H]2O)n2cnc3c(N)ncnc23)[C@@H](O)[C@H]1O
: