Target
P2Y purinoceptor 12
Ligand
BDBM50368125
Substrate
Meas. Tech.
ChEMBL_147742 (CHEMBL756289)
EC50
69±n/a nM
Citation
 Jacobson, KAJarvis, MFWilliams, M Purine and pyrimidine (P2) receptors as drug targets. J Med Chem 45:4057-93 (2002)  
Target
Name:
P2Y purinoceptor 12
Synonyms:
P2Y purinoceptor 12 P2ry12 Purinergic receptor P2Y12
Type:
PROTEIN
Mol. Mass.:
39068.50
Organism:
Rattus norvegicus
Description:
ChEMBL_1454020
Residue:
343
  
Inhibitor
Name:
BDBM50368125
Synonyms:
ADENOSINE DIPHOSPHATE | ADP
Type:
Small organic molecule
Emp. Form.:
C10H15N5O10P2
Mol. Mass.:
427.2011
SMILES:
Nc1ncnc2n(cnc12)[C@@H]1O[C@H](CO[P@@](O)(=O)OP(O)(O)=O)[C@@H](O)[C@H]1O
: