Target
cGMP-specific 3',5'-cyclic phosphodiesterase
Ligand
BDBM50118250
Substrate
Meas. Tech.
ChEMBL_155351 (CHEMBL762496)
Ki
0.290000±n/a nM
Citation
 Sui, ZGuan, JMacielag, MJJiang, WZhang, SQiu, YKraft, PBhattacharjee, SJohn, TMHaynes-Johnson, DClancy, J Pyrimidinylpyrroloquinolones as highly potent and selective PDE5 inhibitors for treatment of erectile dysfunction. J Med Chem 45:4094-6 (2002)  
Target
Name:
cGMP-specific 3',5'-cyclic phosphodiesterase
Synonyms:
3',5'-cyclic phosphodiesterase PDE5 PDE5A_HUMAN Phosphodiesterase 5 (PDE5) Phosphodiesterase 5A (PDE5A) cGMP-specific 3',5'-cyclic phosphodiesterase
Type:
Protein
Mol. Mass.:
99975.83
Organism:
Homo sapiens (Human)
Description:
O76074
Residue:
875
  
Inhibitor
Name:
BDBM50118250
Synonyms:
3-(2,3-Dihydro-benzofuran-5-yl)-2-{5-[4-(2-morpholin-4-yl-ethoxy)-phenyl]-pyrimidin-2-yl}-1,2,3,4-tetrahydro-pyrrolo[3,4-b]quinolin-9-one | CHEMBL133687
Type:
Small organic molecule
Emp. Form.:
C35H33N5O4
Mol. Mass.:
587.6676
SMILES:
Oc1c2CN(C(c2nc2ccccc12)c1ccc2OCCc2c1)c1ncc(cn1)-c1ccc(OCCN2CCOCC2)cc1
: