Target
D(4) dopamine receptor
Ligand
BDBM50118577
Substrate
Meas. Tech.
ChEMBL_60992 (CHEMBL872502)
Ki
72±n/a nM
Citation
 Nichols, DEFrescas, SMarona-Lewicka, DKurrasch-Orbaugh, DM Lysergamides of isomeric 2,4-dimethylazetidines map the binding orientation of the diethylamide moiety in the potent hallucinogenic agent N,N-diethyllysergamide (LSD). J Med Chem 45:4344-9 (2002)  
Target
Name:
D(4) dopamine receptor
Synonyms:
D(2C) dopamine receptor DOPAMINE D4.2 DRD4 Dopamine D4 receptor
Type:
Enzyme
Mol. Mass.:
48373.19
Organism:
Homo sapiens (Human)
Description:
P21917
Residue:
419
  
Inhibitor
Name:
BDBM50118577
Synonyms:
(2,4-Dimethyl-azetidin-1-yl)-(7-methyl-4,6,6a,7,8,9-hexahydro-indolo[4,3-fg]quinolin-9-yl)-methanone | CHEMBL138989
Type:
Small organic molecule
Emp. Form.:
C21H25N3O
Mol. Mass.:
335.4427
SMILES:
C[C@@H]1C[C@@H](C)N1C(=O)[C@H]1CN(C)C2Cc3c[nH]c4cccc(C2=C1)c34
: