Target
D(2) dopamine receptor
Ligand
BDBM21342
Substrate
Meas. Tech.
ChEMBL_61287 (CHEMBL670784)
Ki
120±n/a nM
Citation
 Nichols, DEFrescas, SMarona-Lewicka, DKurrasch-Orbaugh, DM Lysergamides of isomeric 2,4-dimethylazetidines map the binding orientation of the diethylamide moiety in the potent hallucinogenic agent N,N-diethyllysergamide (LSD). J Med Chem 45:4344-9 (2002)  
Target
Name:
D(2) dopamine receptor
Synonyms:
D(2) dopamine receptor DOPAMINE D2 Long DRD2 Dopamine D2 receptor Dopamine D2 receptor (D2R) Dopamine2-like | d2
Type:
Cell-surface receptors
Mol. Mass.:
50647.10
Organism:
Homo sapiens (Human)
Description:
P14416
Residue:
443
  
Inhibitor
Name:
BDBM21342
Synonyms:
(4R,7R)-N,N-diethyl-6-methyl-6,11-diazatetracyclo[7.6.1.0^{2,7}.0^{12,16}]hexadeca-1(16),2,9,12,14-pentaene-4-carboxamide LSD LSD,(+) Lysergic Acid Diethylamide [3H]-LSD | d-Isolysergic acid amide
Type:
radiolabeled ligand
Emp. Form.:
C20H25N3O
Mol. Mass.:
323.432
SMILES:
[H][C@@]12Cc3c[nH]c4cccc(C1=C[C@H](CN2C)C(=O)N(CC)CC)c34
: