Target
5-hydroxytryptamine receptor 2C
Ligand
BDBM50118579
Substrate
Meas. Tech.
ChEMBL_2827 (CHEMBL621513)
Ki
6.5±n/a nM
Citation
 Nichols, DEFrescas, SMarona-Lewicka, DKurrasch-Orbaugh, DM Lysergamides of isomeric 2,4-dimethylazetidines map the binding orientation of the diethylamide moiety in the potent hallucinogenic agent N,N-diethyllysergamide (LSD). J Med Chem 45:4344-9 (2002)  
Target
Name:
5-hydroxytryptamine receptor 2C
Synonyms:
5-HT2C 5-hydroxytryptamine receptor 2C (5HT2c) 5ht1c Htr2c Serotonin receptor 2a and 2c (5HT2A and 5HT2C)
Type:
Enzyme
Mol. Mass.:
51935.10
Organism:
Rattus norvegicus (Rat)
Description:
P08909
Residue:
460
  
Inhibitor
Name:
BDBM50118579
Synonyms:
(2,4-Dimethyl-azetidin-1-yl)-(7-methyl-4,6,6a,7,8,9-hexahydro-indolo[4,3-fg]quinolin-9-yl)-methanone | CHEMBL343755
Type:
Small organic molecule
Emp. Form.:
C21H25N3O
Mol. Mass.:
335.4427
SMILES:
C[C@H]1C[C@H](C)N1C(=O)[C@H]1CN(C)C2Cc3c[nH]c4cccc(C2=C1)c34
: