Target
Beta-secretase 1
Ligand
BDBM50108553
Substrate
Meas. Tech.
ChEMBL_41373 (CHEMBL653496)
IC50
>150000±n/a nM
Citation
 Tung, JSDavis, DLAnderson, JPWalker, DEMamo, SJewett, NHom, RKSinha, SThorsett, EDJohn, V Design of substrate-based inhibitors of human beta-secretase. J Med Chem 45:259-62 (2002)  
Target
Name:
Beta-secretase 1
Synonyms:
ASP2 Aspartyl protease 2 BACE1 Beta-secretase (BACE) Beta-secretase 1 (BACE 1) Beta-secretase 1 (BACE1) Beta-site amyloid precursor protein cleaving enzyme 1 Memapsin-2 beta-Secretase (BACE-1) | beta-Secretase (BACE1)
Type:
Protein
Mol. Mass.:
55755.10
Organism:
Homo sapiens (Human)
Description:
P56817
Residue:
501
  
Inhibitor
Name:
BDBM50108553
Synonyms:
4-(2-{2-[4-(2-Amino-3-carbamoyl-propionylamino)-3-hydroxy-6-methyl-heptanoylamino]-3-methyl-butyrylamino}-propionylamino)-4-(1-carboxy-2-phenyl-ethylcarbamoyl)-butyric acid(NH2-Asn-Sta-Val-Ala-Glu-Phe-COOH) | CHEMBL89773
Type:
Small organic molecule
Emp. Form.:
C34H53N7O11
Mol. Mass.:
735.8249
SMILES:
CC(C)CC(NC(=O)[C@@H](N)CC(N)=O)C(O)CC(=O)N[C@@H](C(C)C)C(=O)N[C@@H](C)C(=O)N[C@@H](CCC(O)=O)C(=O)N[C@@H](Cc1ccccc1)C(O)=O
: