Target
D(2) dopamine receptor
Ligand
BDBM50108701
Substrate
Meas. Tech.
ChEMBL_87873 (CHEMBL697295)
Ki
1500±n/a nM
Citation
 Fletcher, SRBurkamp, FBlurton, PCheng, SKClarkson, RO'Connor, DSpinks, DTudge, Mvan Niel, MBPatel, SChapman, KMarwood, RShepheard, SBentley, GCook, GPBristow, LJCastro, JLHutson, PHMacLeod, AM 4-(Phenylsulfonyl)piperidines: novel, selective, and bioavailable 5-HT(2A) receptor antagonists. J Med Chem 45:492-503 (2002)  
Target
Name:
D(2) dopamine receptor
Synonyms:
D(2) dopamine receptor DOPAMINE D2 Long DRD2 Dopamine D2 receptor Dopamine D2 receptor (D2R) Dopamine2-like | d2
Type:
Cell-surface receptors
Mol. Mass.:
50647.10
Organism:
Homo sapiens (Human)
Description:
P14416
Residue:
443
  
Inhibitor
Name:
BDBM50108701
Synonyms:
1'-[2-(2,4-Difluorophenyl)ethyl]-3,4-dihydrospiro[2H-1-benzothiopyran-2,4'-piperidine]-1,1-dioxide CHEMBL146595
Type:
Small organic molecule
Emp. Form.:
C21H23F2NO2S
Mol. Mass.:
391.475
SMILES:
Fc1ccc(CCN2CCC3(CC2)CCc2ccccc2S3(=O)=O)c(F)c1
: