Target
5-hydroxytryptamine receptor 2C
Ligand
BDBM50099273
Substrate
Meas. Tech.
ChEMBL_2969 (CHEMBL620617)
Ki
10±n/a nM
Citation
 Fletcher, SRBurkamp, FBlurton, PCheng, SKClarkson, RO'Connor, DSpinks, DTudge, Mvan Niel, MBPatel, SChapman, KMarwood, RShepheard, SBentley, GCook, GPBristow, LJCastro, JLHutson, PHMacLeod, AM 4-(Phenylsulfonyl)piperidines: novel, selective, and bioavailable 5-HT(2A) receptor antagonists. J Med Chem 45:492-503 (2002)  
Target
Name:
5-hydroxytryptamine receptor 2C
Synonyms:
5-HT-2C 5-HT2C-INI 5-HTR2C 5-hydroxytryptamine receptor 2C (5-HT-2C) 5HT-1C HTR1C Serotonin (5-HT3) receptor Serotonin Receptor 2C
Type:
G Protein-Coupled Receptor (GPCR)
Mol. Mass.:
51836.79
Organism:
Homo sapiens (Human)
Description:
P28335
Residue:
458
  
Inhibitor
Name:
BDBM50099273
Synonyms:
6-Fluoro-3-(4-fluoro-piperidin-3-yl)-2-phenyl-1H-indole | CHEMBL288856
Type:
Small organic molecule
Emp. Form.:
C19H18F2N2
Mol. Mass.:
312.3564
SMILES:
F[C@@H]1CCNCC1c1c([nH]c2cc(F)ccc12)-c1ccccc1
: