Target
5-hydroxytryptamine receptor 2A
Ligand
BDBM50108710
Substrate
Meas. Tech.
ChEMBL_2622 (CHEMBL621534)
Ki
3.3±n/a nM
Citation
 Fletcher, SRBurkamp, FBlurton, PCheng, SKClarkson, RO'Connor, DSpinks, DTudge, Mvan Niel, MBPatel, SChapman, KMarwood, RShepheard, SBentley, GCook, GPBristow, LJCastro, JLHutson, PHMacLeod, AM 4-(Phenylsulfonyl)piperidines: novel, selective, and bioavailable 5-HT(2A) receptor antagonists. J Med Chem 45:492-503 (2002)  
Target
Name:
5-hydroxytryptamine receptor 2A
Synonyms:
5-HT-2A 5-HT2A 5-hydroxytryptamine receptor 2A (5HT2A) Htr2 Serotonin Receptor 2A
Type:
G Protein-Coupled Receptor (GPCR)
Mol. Mass.:
52852.05
Organism:
Rattus norvegicus (rat)
Description:
Rat cortex membranes 5-HT2A receptors.
Residue:
471
  
Inhibitor
Name:
BDBM50108710
Synonyms:
4-(4-Benzenesulfonyl-piperidin-1-yl)-1-(4-fluoro-phenyl)-butan-1-one | CHEMBL343411
Type:
Small organic molecule
Emp. Form.:
C21H24FNO3S
Mol. Mass.:
389.484
SMILES:
Fc1ccc(cc1)C(=O)CCCN1CCC(CC1)S(=O)(=O)c1ccccc1
: