Target
D(2) dopamine receptor
Ligand
BDBM50108710
Substrate
Meas. Tech.
ChEMBL_87873 (CHEMBL697295)
Ki
1100±n/a nM
Citation
 Fletcher, SRBurkamp, FBlurton, PCheng, SKClarkson, RO'Connor, DSpinks, DTudge, Mvan Niel, MBPatel, SChapman, KMarwood, RShepheard, SBentley, GCook, GPBristow, LJCastro, JLHutson, PHMacLeod, AM 4-(Phenylsulfonyl)piperidines: novel, selective, and bioavailable 5-HT(2A) receptor antagonists. J Med Chem 45:492-503 (2002)  
Target
Name:
D(2) dopamine receptor
Synonyms:
D(2) dopamine receptor DOPAMINE D2 Long DRD2 Dopamine D2 receptor Dopamine D2 receptor (D2R) Dopamine2-like | d2
Type:
Cell-surface receptors
Mol. Mass.:
50647.10
Organism:
Homo sapiens (Human)
Description:
P14416
Residue:
443
  
Inhibitor
Name:
BDBM50108710
Synonyms:
4-(4-Benzenesulfonyl-piperidin-1-yl)-1-(4-fluoro-phenyl)-butan-1-one | CHEMBL343411
Type:
Small organic molecule
Emp. Form.:
C21H24FNO3S
Mol. Mass.:
389.484
SMILES:
Fc1ccc(cc1)C(=O)CCCN1CCC(CC1)S(=O)(=O)c1ccccc1
: