Target
5-hydroxytryptamine receptor 2A
Ligand
BDBM50108706
Substrate
Meas. Tech.
ChEMBL_2622 (CHEMBL621534)
Ki
1.1±n/a nM
Citation
 Fletcher, SRBurkamp, FBlurton, PCheng, SKClarkson, RO'Connor, DSpinks, DTudge, Mvan Niel, MBPatel, SChapman, KMarwood, RShepheard, SBentley, GCook, GPBristow, LJCastro, JLHutson, PHMacLeod, AM 4-(Phenylsulfonyl)piperidines: novel, selective, and bioavailable 5-HT(2A) receptor antagonists. J Med Chem 45:492-503 (2002)  
Target
Name:
5-hydroxytryptamine receptor 2A
Synonyms:
5-HT-2A 5-HT2A 5-hydroxytryptamine receptor 2A (5HT2A) Htr2 Serotonin Receptor 2A
Type:
G Protein-Coupled Receptor (GPCR)
Mol. Mass.:
52852.05
Organism:
Rattus norvegicus (rat)
Description:
Rat cortex membranes 5-HT2A receptors.
Residue:
471
  
Inhibitor
Name:
BDBM50108706
Synonyms:
4-[[1-(2-(2,4-Difluorophenyl)ethyl)-4-piperidinyl]sulfonyl]benzamide CHEMBL148058
Type:
Small organic molecule
Emp. Form.:
C20H22F2N2O3S
Mol. Mass.:
408.462
SMILES:
NC(=O)c1ccc(cc1)S(=O)(=O)C1CCN(CCc2ccc(F)cc2F)CC1
: