Target
5-hydroxytryptamine receptor 2A
Ligand
BDBM50108703
Substrate
Meas. Tech.
ChEMBL_2290 (CHEMBL617075)
Ki
1.2±n/a nM
Citation
 Fletcher, SRBurkamp, FBlurton, PCheng, SKClarkson, RO'Connor, DSpinks, DTudge, Mvan Niel, MBPatel, SChapman, KMarwood, RShepheard, SBentley, GCook, GPBristow, LJCastro, JLHutson, PHMacLeod, AM 4-(Phenylsulfonyl)piperidines: novel, selective, and bioavailable 5-HT(2A) receptor antagonists. J Med Chem 45:492-503 (2002)  
Target
Name:
5-hydroxytryptamine receptor 2A
Synonyms:
5-HT-2 5-HT2A 5-hydroxytryptamine receptor 2A (5HT-2A) 5HT2A_HUMAN HTR2A | Serotonin receptor 2A
Type:
undefined
Mol. Mass.:
52607.65
Organism:
Homo sapiens (Human)
Description:
P28223
Residue:
471
  
Inhibitor
Name:
BDBM50108703
Synonyms:
1-(2-Phenylethyl)-4-(phenylsulfonyl)piperidine CHEMBL148280
Type:
Small organic molecule
Emp. Form.:
C19H23NO2S
Mol. Mass.:
329.456
SMILES:
O=S(=O)(C1CCN(CCc2ccccc2)CC1)c1ccccc1
: