Target
D(2) dopamine receptor
Ligand
BDBM50108713
Substrate
Meas. Tech.
ChEMBL_87873 (CHEMBL697295)
Ki
530±n/a nM
Citation
 Fletcher, SRBurkamp, FBlurton, PCheng, SKClarkson, RO'Connor, DSpinks, DTudge, Mvan Niel, MBPatel, SChapman, KMarwood, RShepheard, SBentley, GCook, GPBristow, LJCastro, JLHutson, PHMacLeod, AM 4-(Phenylsulfonyl)piperidines: novel, selective, and bioavailable 5-HT(2A) receptor antagonists. J Med Chem 45:492-503 (2002)  
Target
Name:
D(2) dopamine receptor
Synonyms:
D(2) dopamine receptor DOPAMINE D2 Long DRD2 Dopamine D2 receptor Dopamine D2 receptor (D2R) Dopamine2-like | d2
Type:
Cell-surface receptors
Mol. Mass.:
50647.10
Organism:
Homo sapiens (Human)
Description:
P14416
Residue:
443
  
Inhibitor
Name:
BDBM50108713
Synonyms:
1'-phenethylspiro[3,4-dihydro-2H-chromene-2,4'-(hexahydropyridine)] | CHEMBL148418
Type:
Small organic molecule
Emp. Form.:
C21H25NO
Mol. Mass.:
307.4293
SMILES:
C(Cc1ccccc1)N1CCC2(CC1)CCc1ccccc1O2
: