Target
Adenosine receptor A3
Ligand
BDBM50080398
Substrate
Meas. Tech.
ChEMBL_31703 (CHEMBL645784)
Ki
68±n/a nM
Citation
 Gao, ZGKim, SKBiadatti, TChen, WLee, KBarak, DKim, SGJohnson, CRJacobson, KA Structural determinants of A(3) adenosine receptor activation: nucleoside ligands at the agonist/antagonist boundary. J Med Chem 45:4471-84 (2002)  
Target
Name:
Adenosine receptor A3
Synonyms:
A3 adenosine receptor (hA3) ADORA3 | Adenosine A3 receptor (A3AR)
Type:
G Protein-Coupled Receptor (GPCR)
Mol. Mass.:
36197.32
Organism:
Homo sapiens (Human)
Description:
P0DMS8
Residue:
318
  
Inhibitor
Name:
BDBM50080398
Synonyms:
(2R,3S,4R,5R)-2-Hydroxymethyl-5-[6-((S)-1-methyl-2-phenyl-ethylamino)-purin-9-yl]-tetrahydro-furan-3,4-diol CHEMBL420705 | N6-[(S)-1-Methyl-2-phenylethyl]ado (S-PIA)
Type:
Small organic molecule
Emp. Form.:
C19H23N5O4
Mol. Mass.:
385.417
SMILES:
C[C@@H](Cc1ccccc1)Nc1ncnc2n(cnc12)[C@@H]1O[C@H](CO)[C@@H](O)[C@H]1O
: