Target
Adenosine receptor A1
Ligand
BDBM50120445
Substrate
Meas. Tech.
ChEMBL_29113 (CHEMBL638725)
Ki
4300±n/a nM
Citation
 Bondavalli, FBotta, MBruno, OCiacci, ACorelli, FFossa, PLucacchini, AManetti, FMartini, CMenozzi, GMosti, LRanise, ASchenone, STafi, ATrincavellic, ML Synthesis, molecular modeling studies, and pharmacological activity of selective A(1) receptor antagonists. J Med Chem 45:4875-87 (2002)  
Target
Name:
Adenosine receptor A1
Synonyms:
AA1R_BOVIN ADENOSINE A1 high ADORA1 | Adenosine A1 receptor
Type:
Enzyme Catalytic Domain
Mol. Mass.:
36602.99
Organism:
BOVINE
Description:
ADENOSINE 0 BOVINE::P28190
Residue:
326
  
Inhibitor
Name:
BDBM50120445
Synonyms:
1-Methyl-4-phenethylamino-1H-pyrazolo[3,4-b]pyridine-5-carboxylic acid ethyl ester | CHEMBL144928
Type:
Small organic molecule
Emp. Form.:
C18H20N4O2
Mol. Mass.:
324.377
SMILES:
CCOC(=O)c1cnc2n(C)ncc2c1NCCc1ccccc1
: