Target
Adenosine receptor A1
Ligand
BDBM50104334
Substrate
Meas. Tech.
ChEMBL_29118 (CHEMBL638730)
Ki
73±n/a nM
Citation
 Bondavalli, FBotta, MBruno, OCiacci, ACorelli, FFossa, PLucacchini, AManetti, FMartini, CMenozzi, GMosti, LRanise, ASchenone, STafi, ATrincavellic, ML Synthesis, molecular modeling studies, and pharmacological activity of selective A(1) receptor antagonists. J Med Chem 45:4875-87 (2002)  
Target
Name:
Adenosine receptor A1
Synonyms:
AA1R_RAT ADENOSINE A1 high Adenosine A1 receptor (A1) Adenosine receptors A1 | Adora1
Type:
Protein
Mol. Mass.:
36704.13
Organism:
Rattus norvegicus (rat)
Description:
Residue:
326
  
Inhibitor
Name:
BDBM50104334
Synonyms:
1-(2-Chloro-2-phenyl-ethyl)-4-phenethylamino-1H-pyrazolo[3,4-b]pyridine-5-carboxylic acid ethyl ester ethyl 1-(2-chloro-2-phenylethyl)-4-(phenethylamino)-1H-pyrazolo[3,4-b]pyridine-5-carboxylate
Type:
Small organic molecule
Emp. Form.:
C25H25ClN4O2
Mol. Mass.:
448.945
SMILES:
CCOC(=O)c1cnc2n(CC(Cl)c3ccccc3)ncc2c1NCCc1ccccc1
: