Target
Mu-type opioid receptor
Ligand
BDBM50121312
Substrate
Meas. Tech.
ChEMBL_148221 (CHEMBL754711)
Ki
75±n/a nM
Citation
 Halab, LBecker, JADarula, ZTourwé, DKieffer, BLSimonin, FLubell, WD Probing opioid receptor interactions with azacycloalkane amino acids. Synthesis of a potent and selective ORL1 antagonist. J Med Chem 45:5353-7 (2002)  
Target
Name:
Mu-type opioid receptor
Synonyms:
M-OR-1 MOR-1 MUOR1 Mu opiate receptor OPRM1 hMOP | mu-type opioid receptor isoform MOR-1
Type:
G Protein-Coupled Receptor (GPCR)
Mol. Mass.:
44789.51
Organism:
Homo sapiens (Human)
Description:
P35372
Residue:
400
  
Inhibitor
Name:
BDBM50121312
Synonyms:
Ac-Arg-D-Cha-I2aa-D-Arg-D-pClPhe-NH2 | CHEMBL266609
Type:
Small organic molecule
Emp. Form.:
C40H62ClN13O7S
Mol. Mass.:
904.521
SMILES:
CC(=O)N[C@@H](CCCNC(N)=N)C(=O)N[C@@H](CC1CCCCC1)C(=O)N[C@H]1CC[C@H]2SC[C@H](N2C1=O)C(=O)N[C@H](CCCNC(N)=N)C(=O)NC(Cc1ccc(Cl)cc1)C(N)=O
: