Target
Kappa-type opioid receptor
Ligand
BDBM50121314
Substrate
Meas. Tech.
ChEMBL_147244 (CHEMBL755512)
Ki
1700±n/a nM
Citation
 Halab, LBecker, JADarula, ZTourwé, DKieffer, BLSimonin, FLubell, WD Probing opioid receptor interactions with azacycloalkane amino acids. Synthesis of a potent and selective ORL1 antagonist. J Med Chem 45:5353-7 (2002)  
Target
Name:
Kappa-type opioid receptor
Synonyms:
K-OR-1 Kappa-opioid receptor (KOR) Kappa-type opioid receptor (KOR) OPIATE Kappa OPRK1 kappa opioid receptor (KOR)
Type:
G Protein-Coupled Receptor (GPCR)
Mol. Mass.:
42648.76
Organism:
Homo sapiens (Human)
Description:
P41145
Residue:
380
  
Inhibitor
Name:
BDBM50121314
Synonyms:
Ac-Arg-D-Cha-Phe-5-tBuPro-D-Arg-D-pClPhe-NH2 | CHEMBL2371034
Type:
Small organic molecule
Emp. Form.:
C50H76ClN13O7
Mol. Mass.:
1006.674
SMILES:
[#6]-[#6](=O)-[#7]-[#6@@H](-[#6]-[#6]-[#6]\[#7]=[#6](\[#7])-[#7])-[#6](=O)-[#7]-[#6@@H](-[#6]-[#6]-1-[#6]-[#6]-[#6]-[#6]-[#6]-1)-[#6](=O)-[#7]-[#6@@H](-[#6]-c1ccccc1)-[#6](=O)-[#7]-1-[#6@@H](-[#6]-[#6]-[#6@@H]-1C([#6])([#6])[#6])-[#6](=O)-[#7]-[#6@H](-[#6]-[#6]-[#6]\[#7]=[#6](\[#7])-[#7])-[#6](=O)-[#7]-[#6@@H](-[#6]-c1ccc(Cl)cc1)-[#6](-[#7])=O
: