Target
Delta-type opioid receptor
Ligand
BDBM50026995
Substrate
Meas. Tech.
ChEMBL_147183 (CHEMBL754482)
Ki
1.2±n/a nM
Citation
 Schütz, JDersch, CMHorel, RSpetea, MKoch, MMeditz, RGreiner, ERothman, RBSchmidhammer, H Synthesis and biological evaluation of 14-alkoxymorphinans. 17. Highly delta opioid receptor selective 14-alkoxy-substituted indolo- and benzofuromorphinans. J Med Chem 45:5378-83 (2002)  
Target
Name:
Delta-type opioid receptor
Synonyms:
Cytochrome P450 3A4 Delta opioid receptor Delta-type opioid receptor (DOR) OPRD_RAT Opioid receptor Opioid receptors; mu & delta Ror-a | Voltage-gated potassium channel
Type:
G Protein-Coupled Receptor (GPCR)
Mol. Mass.:
40465.04
Organism:
Rattus norvegicus (rat)
Description:
Competition binding assays were using CHO-K1 cell membranes expressing the opioid receptor.
Residue:
372
  
Inhibitor
Name:
BDBM50026995
Synonyms:
CHEMBL2113653
Type:
Small organic molecule
Emp. Form.:
C27H27NO4
Mol. Mass.:
429.5076
SMILES:
[H][C@@]12Oc3c4c(C[C@@]5([H])N(CC=C)CC[C@@]14[C@]5(Cc1c2oc2ccccc12)OCC)ccc3O
: