Target
ATP-dependent translocase ABCB1
Ligand
BDBM25756
Substrate
Meas. Tech.
ChEMBL_147982 (CHEMBL753510)
Ki
200000±n/a nM
Citation
 Pajeva, IKWiese, M Pharmacophore model of drugs involved in P-glycoprotein multidrug resistance: explanation of structural variety (hypothesis). J Med Chem 45:5671-86 (2002)  
Target
Name:
ATP-dependent translocase ABCB1
Synonyms:
ABCB1 MDR1_HUMAN Multidrug resistance protein 1 P-glycoprotein (P-gp) PGY1
Type:
Protein
Mol. Mass.:
141503.50
Organism:
Homo sapiens (Human)
Description:
P08183
Residue:
1280
  
Inhibitor
Name:
BDBM25756
Synonyms:
(2R,3R)-2,3-dihydroxysuccinic acid;1-(isopropylamino)-3-[4-(2-methoxyethyl)phenoxy]propan-2-ol CHEMBL13 Spesicor metoprolol tartrate | {2-hydroxy-3-[4-(2-methoxyethyl)phenoxy]propyl}(propan-2-yl)amine
Type:
Small organic molecule
Emp. Form.:
C15H25NO3
Mol. Mass.:
267.3639
SMILES:
COCCc1ccc(OCC(O)CNC(C)C)cc1
: