Target
ATP-dependent translocase ABCB1
Ligand
BDBM50241343
Substrate
Meas. Tech.
ChEMBL_147865 (CHEMBL755181)
IC50
89000±n/a nM
Citation
 Pajeva, IKWiese, M Pharmacophore model of drugs involved in P-glycoprotein multidrug resistance: explanation of structural variety (hypothesis). J Med Chem 45:5671-86 (2002)  
Target
Name:
ATP-dependent translocase ABCB1
Synonyms:
ABCB1 MDR1_HUMAN Multidrug resistance protein 1 P-glycoprotein (P-gp) PGY1
Type:
Protein
Mol. Mass.:
141503.50
Organism:
Homo sapiens (Human)
Description:
P08183
Residue:
1280
  
Inhibitor
Name:
BDBM50241343
Synonyms:
(RS)-6-methoxy-2-((4-methoxy-3,5-dimethylpyridin-2-yl) methylsulfinyl)-1H-benzo[d]imidazole 2-(3-methoxy-2,4-dimethylbenzylsulfinyl)-6-methoxy-1H-benzo[d]imidazole 5-Methoxy-2-(4-methoxy-3,5-dimethyl-pyridin-2-ylmethanesulfinyl)-1H-benzoimidazole (omeprazole) 5-methoxy-2-((4-methoxy-3,5-dimethylpyridin-2-yl)methylsulfinyl)-1H-benzo[d]imidazole 6-methoxy-2-((4-methoxy-3,5-dimethylpyridin-2-yl)methylsulfinyl)-1H-benzo[d]imidazole ESOMEPRAZOLE SODIUM OMEPRAZOLE Prilosec | cid_4594
Type:
Small organic molecule
Emp. Form.:
C17H19N3O3S
Mol. Mass.:
345.416
SMILES:
COc1ccc2nc([nH]c2c1)S(=O)Cc1ncc(C)c(OC)c1C
: