Target
ATP-dependent translocase ABCB1
Ligand
BDBM50121978
Substrate
Meas. Tech.
ChEMBL_147865 (CHEMBL755181)
IC50
500±n/a nM
Citation
 Pajeva, IKWiese, M Pharmacophore model of drugs involved in P-glycoprotein multidrug resistance: explanation of structural variety (hypothesis). J Med Chem 45:5671-86 (2002)  
Target
Name:
ATP-dependent translocase ABCB1
Synonyms:
ABCB1 MDR1_HUMAN Multidrug resistance protein 1 P-glycoprotein (P-gp) PGY1
Type:
Protein
Mol. Mass.:
141503.50
Organism:
Homo sapiens (Human)
Description:
P08183
Residue:
1280
  
Inhibitor
Name:
BDBM50121978
Synonyms:
2-(6-Amino-3-imino-3H-xanthen-9-yl)-benzoic acid methyl ester | CHEMBL347534
Type:
Small organic molecule
Emp. Form.:
C21H16N2O3
Mol. Mass.:
344.3633
SMILES:
COC(=O)c1ccccc1-c1c2ccc(N)cc2oc2cc(=N)ccc12
: