Target
Vascular endothelial growth factor receptor 1
Ligand
BDBM4810
Substrate
Meas. Tech.
ChEMBL_213957 (CHEMBL811935)
IC50
43±n/a nM
Citation
 Manley, PWFuret, PBold, GBrüggen, JMestan, JMeyer, TSchnell, CRWood, JHaberey, MHuth, AKrüger, MMenrad, AOttow, ESeidelmann, DSiemeister, GThierauch, KH Anthranilic acid amides: a novel class of antiangiogenic VEGF receptor kinase inhibitors. J Med Chem 45:5687-93 (2002)  
Target
Name:
Vascular endothelial growth factor receptor 1
Synonyms:
FLT FRT Fms-like tyrosine kinase 1 Tyrosine-protein kinase FRT VEGFR-1 VGFR1_HUMAN Vascular endothelial growth factor receptor 1 (FLT1) Vascular endothelial growth factor receptor 1 and 2 (Flt-1 and KDR) Vascular permeability factor receptor vascular endothelial growth factor/vascular permeability factor receptor
Type:
Receptor Tyrosine Kinase
Mol. Mass.:
150800.23
Organism:
Homo sapiens (Human)
Description:
P17948
Residue:
1338
  
Inhibitor
Name:
BDBM4810
Synonyms:
(3Z)-3-[(3,5-dimethyl-1H-pyrrol-2-yl)methylidene]-2,3-dihydro-1H-indol-2-one CHEMBL276711 SU5416 US10189853, semaxanib US9422297, SU5416 | cid_5329098
Type:
Small organic molecule
Emp. Form.:
C15H14N2O
Mol. Mass.:
238.2845
SMILES:
Cc1cc(C)c(\C=C2/C(=O)Nc3ccccc23)[nH]1
: