Target
Melanocortin receptor 3
Ligand
BDBM50122061
Substrate
Meas. Tech.
ChEMBL_106838 (CHEMBL878355)
EC50
27000±n/a nM
Citation
 Holder, JRXiang, ZBauzo, RMHaskell-Luevano, C Structure-activity relationships of the melanocortin tetrapeptide Ac-His-D-Phe-Arg-Trp-NH2 at the mouse melanocortin receptors. 4. Modifications at the Trp position. J Med Chem 45:5736-44 (2002)  
Target
Name:
Melanocortin receptor 3
Synonyms:
MC3-R Mc3r
Type:
PROTEIN
Mol. Mass.:
35808.24
Organism:
Mus musculus
Description:
ChEMBL_1498848
Residue:
323
  
Inhibitor
Name:
BDBM50122061
Synonyms:
Ac-His-D-Phe-Arg-Phe-NH2 | CHEMBL152986
Type:
Small organic molecule
Emp. Form.:
C32H42N10O5
Mol. Mass.:
646.7399
SMILES:
CC(=O)N[C@@H](Cc1cnc[nH]1)C(=O)N[C@@H](Cc1ccccc1)C(=O)N[C@@H](CCCNC(N)=N)C(=O)N[C@H](Cc1ccccc1)C(N)=O
: