Target
Melanocortin receptor 5
Ligand
BDBM50122068
Substrate
Meas. Tech.
ChEMBL_104262 (CHEMBL711699)
EC50
38400±n/a nM
Citation
 Holder, JRXiang, ZBauzo, RMHaskell-Luevano, C Structure-activity relationships of the melanocortin tetrapeptide Ac-His-D-Phe-Arg-Trp-NH2 at the mouse melanocortin receptors. 4. Modifications at the Trp position. J Med Chem 45:5736-44 (2002)  
Target
Name:
Melanocortin receptor 5
Synonyms:
MC5R_MOUSE Melanocortin receptor 5 | Melanocortin receptor 5 (MC5R)
Type:
Enzyme
Mol. Mass.:
36966.58
Organism:
Mus musculus (Mouse)
Description:
P41149
Residue:
325
  
Inhibitor
Name:
BDBM50122068
Synonyms:
Ac-His-D-Phe-Arg-Ala-NH2 | CHEMBL359318
Type:
Small organic molecule
Emp. Form.:
C26H38N10O5
Mol. Mass.:
570.6439
SMILES:
CC(NC(=O)[C@H](CCCNC(N)=N)NC(=O)[C@H](Cc1ccccc1)NC(=O)[C@H](Cc1cnc[nH]1)NC(C)=O)C(N)=O
: