Target
Melanocyte-stimulating hormone receptor
Ligand
BDBM50122076
Substrate
Meas. Tech.
ChEMBL_106823 (CHEMBL717664)
EC50
127±n/a nM
Citation
 Holder, JRXiang, ZBauzo, RMHaskell-Luevano, C Structure-activity relationships of the melanocortin tetrapeptide Ac-His-D-Phe-Arg-Trp-NH2 at the mouse melanocortin receptors. 4. Modifications at the Trp position. J Med Chem 45:5736-44 (2002)  
Target
Name:
Melanocyte-stimulating hormone receptor
Synonyms:
MC1-R Mc1r Melanocyte-stimulating hormone receptor | Msh-r
Type:
PROTEIN
Mol. Mass.:
35238.60
Organism:
Mus musculus
Description:
ChEMBL_1498846
Residue:
315
  
Inhibitor
Name:
BDBM50122076
Synonyms:
Ac-His-D-Phe-Arg-D-Nal(2')-NH2 | CHEMBL347216
Type:
Small organic molecule
Emp. Form.:
C36H44N10O5
Mol. Mass.:
696.7986
SMILES:
CC(=O)N[C@@H](Cc1cnc[nH]1)C(=O)N[C@@H](Cc1ccccc1)C(=O)N[C@@H](CCCNC(N)=N)C(=O)N[C@@H](Cc1ccc2ccccc2c1)C(N)=O
: