Target
Mu-type opioid receptor
Ligand
BDBM50060073
Substrate
Meas. Tech.
ChEMBL_148858 (CHEMBL756654)
Ki
27700±n/a nM
Citation
 Balboni, GGuerrini, RSalvadori, SBianchi, CRizzi, DBryant, SDLazarus, LH Evaluation of the Dmt-Tic pharmacophore: conversion of a potent delta-opioid receptor antagonist into a potent delta agonist and ligands with mixed properties. J Med Chem 45:713-20 (2002)  
Target
Name:
Mu-type opioid receptor
Synonyms:
MOR-1 Mu-type opioid receptor (MOR) OPRM_RAT Opioid receptor B Ror-b
Type:
G Protein-Coupled Receptor (GPCR)
Mol. Mass.:
44503.11
Organism:
Rattus norvegicus (rat)
Description:
Competition binding assays were carried out using membrane preparations from transfected HN9.10 cells that constitutively expressed the mu opioid receptor.
Residue:
398
  
Inhibitor
Name:
BDBM50060073
Synonyms:
2-[(S)-2-Amino-3-(4-hydroxy-2,6-dimethyl-phenyl)-propionyl]-1,2,3,4-tetrahydro-isoquinoline-3-carboxylic acid amide 2-[2-amino-3-(4-hydroxy-2,6-dimethylphenyl)-(2S)-propanoyl]-1,2,3,4-tetrahydro-3-isoquinolinecarboxamide | CHEMBL93041
Type:
Small organic molecule
Emp. Form.:
C21H25N3O3
Mol. Mass.:
367.4415
SMILES:
Cc1cc(O)cc(C)c1C[C@H](N)C(=O)N1Cc2ccccc2CC1C(N)=O
: