Target
Disintegrin and metalloproteinase domain-containing protein 9
Ligand
BDBM50370192
Substrate
Meas. Tech.
ChEMBL_63593 (CHEMBL675240)
IC50
>10000±n/a nM
Citation
 Sawa, MKiyoi, TKurokawa, KKumihara, HYamamoto, MMiyasaka, TIto, YHirayama, RInoue, TKirii, YNishiwaki, EOhmoto, HMaeda, YIshibushi, EInoue, YYoshino, KKondo, H New type of metalloproteinase inhibitor: design and synthesis of new phosphonamide-based hydroxamic acids. J Med Chem 45:919-29 (2002)  
Target
Name:
Disintegrin and metalloproteinase domain-containing protein 9
Synonyms:
ADAM9 Disintegrin and metalloproteinase domain-containing protein 9 (ADAM9) MCMP MLTNG
Type:
Enzyme
Mol. Mass.:
90567.68
Organism:
Homo sapiens (Human)
Description:
Q13443
Residue:
819
  
Inhibitor
Name:
BDBM50370192
Synonyms:
CHEMBL418655
Type:
Small organic molecule
Emp. Form.:
C19H23N2O5P
Mol. Mass.:
390.3701
SMILES:
CCO[P@](=O)(N1Cc2ccccc2C[C@H]1C(=O)NO)c1ccc(OC)cc1
: