Target
Neuronal acetylcholine receptor subunit beta-4
Ligand
BDBM50110263
Substrate
Meas. Tech.
ChEMBL_143393 (CHEMBL750860)
Ki
259±n/a nM
Citation
 Gohlke, HGündisch, DSchwarz, SSeitz, GTilotta, MCWegge, T Synthesis and nicotinic binding studies on enantiopure diazine analogues of the novel (2-chloro-5-pyridyl)-9-azabicyclo[4.2.1]non-2-ene UB-165. J Med Chem 45:1064-72 (2002)  
Target
Name:
Neuronal acetylcholine receptor subunit beta-4
Synonyms:
ACHB4_RAT Chrnb4 Neuronal acetylcholine receptor non-alpha-2 chain | Neuronal acetylcholine receptor protein beta-4 subunit
Type:
Enzyme
Mol. Mass.:
55863.89
Organism:
Rattus norvegicus (Rat)
Description:
P12392
Residue:
495
  
Inhibitor
Name:
BDBM50110263
Synonyms:
2-Pyrazin-2-yl-9-aza-bicyclo[4.2.1]non-2-ene | CHEMBL10863
Type:
Small organic molecule
Emp. Form.:
C12H15N3
Mol. Mass.:
201.2676
SMILES:
C1CC2N[C@H]1CCC=C2c1cnccn1
: