Target
Carbonic anhydrase 1
Ligand
BDBM50292131
Substrate
Meas. Tech.
ChEMBL_47497 (CHEMBL662724)
Ki
650±n/a nM
Citation
 Scozzafava, AMenabuoni, LMincione, FSupuran, CT Carbonic anhydrase inhibitors. A general approach for the preparation of water-soluble sulfonamides incorporating polyamino-polycarboxylate tails and of their metal complexes possessing long-lasting, topical intraocular pressure-lowering properties. J Med Chem 45:1466-76 (2002)  
Target
Name:
Carbonic anhydrase 1
Synonyms:
CA-I CAB Carbonate dehydratase I Carbonic anhydrase 1 (CA I) Carbonic anhydrase 1 (Recombinant CA I) Carbonic anhydrase B Carbonic anhydrase I (CA I) Carbonic anhydrase I (CAI) Carbonic anhydrase isoenzyme I (hCA I) | hCA
Type:
Enzyme
Mol. Mass.:
28873.37
Organism:
Homo sapiens (Human)
Description:
P00915
Residue:
261
  
Inhibitor
Name:
BDBM50292131
Synonyms:
([2-(Bis-carboxymethyl-amino)-ethyl]-{[2-(4-sulfamoyl-phenyl)-ethylcarbamoyl]-methyl}-amino)-acetic acid | CHEMBL35747
Type:
Small organic molecule
Emp. Form.:
C18H26N4O9S
Mol. Mass.:
474.485
SMILES:
NS(=O)(=O)c1ccc(CCNC(=O)CN(CCN(CC(O)=O)CC(O)=O)CC(O)=O)cc1
: